Von make-error, 4 Monate vorher, geschrieben in Plain Text.
[paste_expire] 1 Sekunde.
Einbetten
  1. py3-none-any.whl
  2. Collecting cryptography
  3.   Using cached https://files.pythonhosted.org/packages/be/60/da377e1bed002716fb2d5d1d1cab720f298cb33ecff7bf7adea72788e4e4/cryptography-2.8.tar.gz
  4.   Installing build dependencies ... error
  5.   ERROR: Command errored out with exit status 1:
  6.    command: /opt/syncserver/local/bin/python2 /opt/syncserver/local/local/lib/python2.7/site-packages/pip install --ignore-installed --no-user --prefix /tmp/pip-build-env-2r8NSu/overlay --no-warn-script-location --no-binary :none: --only-binary :none: -i https://pypi.org/simple -- 'setuptools>=40.6.0' wheel 'cffi>=1.8,!=1.11.3; platform_python_implementation != '"'"'PyPy'"'"''
  7.        cwd: None
  8.   Complete output (100 lines):
  9.   DEPRECATION: Python 2.7 will reach the end of its life on January 1st, 2020. Please upgrade your Python as Python 2.7 won't be maintained after that date. A future version of pip will drop support for Python 2.7. More details about Python 2 support in pip, can be found at https://pip.pypa.io/en/latest/development/release-process/#python-2-support
  10.   Collecting setuptools>=40.6.0
  11.     Using cached https://files.pythonhosted.org/packages/d9/de/554b6310ac87c5b921bc45634b07b11394fe63bc4cb5176f5240addf18ab/setuptools-41.6.0-py2.py3-none-any.whl
  12.   Collecting wheel
  13.     Using cached https://files.pythonhosted.org/packages/00/83/b4a77d044e78ad1a45610eb88f745be2fd2c6d658f9798a15e384b7d57c9/wheel-0.33.6-py2.py3-none-any.whl
  14.   Collecting cffi!=1.11.3,>=1.8
  15.     Using cached https://files.pythonhosted.org/packages/2d/bf/960e5a422db3ac1a5e612cb35ca436c3fc985ed4b7ed13a1b4879006f450/cffi-1.13.2.tar.gz
  16.   Processing /root/.cache/pip/wheels/f2/9a/90/de94f8556265ddc9d9c8b271b0f63e57b26fb1d67a45564511/pycparser-2.19-py2.py3-none-any.whl
  17.   Building wheels for collected packages: cffi
  18.     Building wheel for cffi (setup.py): started
  19.     Building wheel for cffi (setup.py): finished with status 'error'
  20.     ERROR: Command errored out with exit status 1:
  21.      command: /opt/syncserver/local/bin/python2 -u -c 'import sys, setuptools, tokenize; sys.argv[0] = '"'"'/tmp/pip-install-E4dibJ/cffi/setup.py'"'"'; __file__='"'"'/tmp/pip-install-E4dibJ/cffi/setup.py'"'"';f=getattr(tokenize, '"'"'open'"'"', open)(__file__);code=f.read().replace('"'"'\r\n'"'"', '"'"'\n'"'"');f.close();exec(compile(code, __file__, '"'"'exec'"'"'))' bdist_wheel -d /tmp/pip-wheel-eORFd0 --python-tag cp27
  22.          cwd: /tmp/pip-install-E4dibJ/cffi/
  23.     Complete output (36 lines):
  24.     running bdist_wheel
  25.     running build
  26.     running build_py
  27.     creating build
  28.     creating build/lib.linux-aarch64-2.7
  29.     creating build/lib.linux-aarch64-2.7/cffi
  30.     copying cffi/setuptools_ext.py -> build/lib.linux-aarch64-2.7/cffi
  31.     copying cffi/vengine_cpy.py -> build/lib.linux-aarch64-2.7/cffi
  32.     copying cffi/verifier.py -> build/lib.linux-aarch64-2.7/cffi
  33.     copying cffi/error.py -> build/lib.linux-aarch64-2.7/cffi
  34.     copying cffi/pkgconfig.py -> build/lib.linux-aarch64-2.7/cffi
  35.     copying cffi/commontypes.py -> build/lib.linux-aarch64-2.7/cffi
  36.     copying cffi/cffi_opcode.py -> build/lib.linux-aarch64-2.7/cffi
  37.     copying cffi/vengine_gen.py -> build/lib.linux-aarch64-2.7/cffi
  38.     copying cffi/backend_ctypes.py -> build/lib.linux-aarch64-2.7/cffi
  39.     copying cffi/recompiler.py -> build/lib.linux-aarch64-2.7/cffi
  40.     copying cffi/__init__.py -> build/lib.linux-aarch64-2.7/cffi
  41.     copying cffi/cparser.py -> build/lib.linux-aarch64-2.7/cffi
  42.     copying cffi/model.py -> build/lib.linux-aarch64-2.7/cffi
  43.     copying cffi/ffiplatform.py -> build/lib.linux-aarch64-2.7/cffi
  44.     copying cffi/api.py -> build/lib.linux-aarch64-2.7/cffi
  45.     copying cffi/lock.py -> build/lib.linux-aarch64-2.7/cffi
  46.     copying cffi/_cffi_include.h -> build/lib.linux-aarch64-2.7/cffi
  47.     copying cffi/parse_c_type.h -> build/lib.linux-aarch64-2.7/cffi
  48.     copying cffi/_embedding.h -> build/lib.linux-aarch64-2.7/cffi
  49.     copying cffi/_cffi_errors.h -> build/lib.linux-aarch64-2.7/cffi
  50.     running build_ext
  51.     building '_cffi_backend' extension
  52.     creating build/temp.linux-aarch64-2.7
  53.     creating build/temp.linux-aarch64-2.7/c
  54.     aarch64-linux-gnu-gcc -pthread -DNDEBUG -g -fwrapv -O2 -Wall -Wstrict-prototypes -fno-strict-aliasing -Wno-error -Wno-error=format-security -fPIC -DUSE__THREAD -DHAVE_SYNC_SYNCHRONIZE -I/usr/include/ffi -I/usr/include/libffi -I/usr/include/python2.7 -c c/_cffi_backend.c -o build/temp.linux-aarch64-2.7/c/_cffi_backend.o
  55.     c/_cffi_backend.c:15:10: fatal error: ffi.h: No such file or directory
  56.      #include <ffi.h>
  57.               ^~~~~~~
  58.     compilation terminated.
  59.     error: command 'aarch64-linux-gnu-gcc' failed with exit status 1
  60.     ----------------------------------------
  61.     ERROR: Failed building wheel for cffi
  62.     Running setup.py clean for cffi
  63.   Failed to build cffi
  64.   Installing collected packages: setuptools, wheel, pycparser, cffi
  65.       Running setup.py install for cffi: started
  66.       Running setup.py install for cffi: finished with status 'error'
  67.       ERROR: Command errored out with exit status 1:
  68.        command: /opt/syncserver/local/bin/python2 -u -c 'import sys, setuptools, tokenize; sys.argv[0] = '"'"'/tmp/pip-install-E4dibJ/cffi/setup.py'"'"'; __file__='"'"'/tmp/pip-install-E4dibJ/cffi/setup.py'"'"';f=getattr(tokenize, '"'"'open'"'"', open)(__file__);code=f.read().replace('"'"'\r\n'"'"', '"'"'\n'"'"');f.close();exec(compile(code, __file__, '"'"'exec'"'"'))' install --record /tmp/pip-record-JaNobg/install-record.txt --single-version-externally-managed --prefix /tmp/pip-build-env-2r8NSu/overlay --compile --install-headers /opt/syncserver/local/include/site/python2.7/cffi
  69.            cwd: /tmp/pip-install-E4dibJ/cffi/
  70.       Complete output (36 lines):
  71.       running install
  72.       running build
  73.       running build_py
  74.       creating build
  75.       creating build/lib.linux-aarch64-2.7
  76.       creating build/lib.linux-aarch64-2.7/cffi
  77.       copying cffi/setuptools_ext.py -> build/lib.linux-aarch64-2.7/cffi
  78.       copying cffi/vengine_cpy.py -> build/lib.linux-aarch64-2.7/cffi
  79.       copying cffi/verifier.py -> build/lib.linux-aarch64-2.7/cffi
  80.       copying cffi/error.py -> build/lib.linux-aarch64-2.7/cffi
  81.       copying cffi/pkgconfig.py -> build/lib.linux-aarch64-2.7/cffi
  82.       copying cffi/commontypes.py -> build/lib.linux-aarch64-2.7/cffi
  83.       copying cffi/cffi_opcode.py -> build/lib.linux-aarch64-2.7/cffi
  84.       copying cffi/vengine_gen.py -> build/lib.linux-aarch64-2.7/cffi
  85.       copying cffi/backend_ctypes.py -> build/lib.linux-aarch64-2.7/cffi
  86.       copying cffi/recompiler.py -> build/lib.linux-aarch64-2.7/cffi
  87.       copying cffi/__init__.py -> build/lib.linux-aarch64-2.7/cffi
  88.       copying cffi/cparser.py -> build/lib.linux-aarch64-2.7/cffi
  89.       copying cffi/model.py -> build/lib.linux-aarch64-2.7/cffi
  90.       copying cffi/ffiplatform.py -> build/lib.linux-aarch64-2.7/cffi
  91.       copying cffi/api.py -> build/lib.linux-aarch64-2.7/cffi
  92.       copying cffi/lock.py -> build/lib.linux-aarch64-2.7/cffi
  93.       copying cffi/_cffi_include.h -> build/lib.linux-aarch64-2.7/cffi
  94.       copying cffi/parse_c_type.h -> build/lib.linux-aarch64-2.7/cffi
  95.       copying cffi/_embedding.h -> build/lib.linux-aarch64-2.7/cffi
  96.       copying cffi/_cffi_errors.h -> build/lib.linux-aarch64-2.7/cffi
  97.       running build_ext
  98.       building '_cffi_backend' extension
  99.       creating build/temp.linux-aarch64-2.7
  100.       creating build/temp.linux-aarch64-2.7/c
  101.       aarch64-linux-gnu-gcc -pthread -DNDEBUG -g -fwrapv -O2 -Wall -Wstrict-prototypes -fno-strict-aliasing -Wno-error -Wno-error=format-security -fPIC -DUSE__THREAD -DHAVE_SYNC_SYNCHRONIZE -I/usr/include/ffi -I/usr/include/libffi -I/usr/include/python2.7 -c c/_cffi_backend.c -o build/temp.linux-aarch64-2.7/c/_cffi_backend.o
  102.       c/_cffi_backend.c:15:10: fatal error: ffi.h: No such file or directory
  103.        #include <ffi.h>
  104.                 ^~~~~~~
  105.       compilation terminated.
  106.       error: command 'aarch64-linux-gnu-gcc' failed with exit status 1
  107.       ----------------------------------------
  108.   ERROR: Command errored out with exit status 1: /opt/syncserver/local/bin/python2 -u -c 'import sys, setuptools, tokenize; sys.argv[0] = '"'"'/tmp/pip-install-E4dibJ/cffi/setup.py'"'"'; __file__='"'"'/tmp/pip-install-E4dibJ/cffi/setup.py'"'"';f=getattr(tokenize, '"'"'open'"'"', open)(__file__);code=f.read().replace('"'"'\r\n'"'"', '"'"'\n'"'"');f.close();exec(compile(code, __file__, '"'"'exec'"'"'))' install --record /tmp/pip-record-JaNobg/install-record.txt --single-version-externally-managed --prefix /tmp/pip-build-env-2r8NSu/overlay --compile --install-headers /opt/syncserver/local/include/site/python2.7/cffi Check the logs for full command output.
  109.   ----------------------------------------
  110. ERROR: Command errored out with exit status 1: /opt/syncserver/local/bin/python2 /opt/syncserver/local/local/lib/python2.7/site-packages/pip install --ignore-installed --no-user --prefix /tmp/pip-build-env-2r8NSu/overlay --no-warn-script-location --no-binary :none: --only-binary :none: -i https://pypi.org/simple -- 'setuptools>=40.6.0' wheel 'cffi>=1.8,!=1.11.3; platform_python_implementation != '"'"'PyPy'"'"'' Check the logs for full command output.
  111. Makefile:27: recipe for target 'local/COMPLETE' failed
  112. make: *** [local/COMPLETE] Error 1
  113. root@SYNC:/opt/syncserver# make
  114.  
captcha